Reaction Details
TargetCasein kinase I isoform delta
LigandBDBM50008365
Substrate/Competitorn/a
Meas. Tech.ChEMBL_1334961 (CHEMBL3239314)
IC50 2690±n/a nM
Citation Salado, IGRedondo, MBello, MLPerez, CLiachko, NFKraemer, BCMiguel, LLecourtois, MGil, CMartinez, APerez, DI Protein kinase CK-1 inhibitors as new potential drugs for amyotrophic lateral sclerosis. J Med Chem57:2755-72 (2014) 
 
Casein kinase I isoform delta
Name:Casein kinase I isoform delta
Type:Enzyme
Mol. Mass.:47356.76
Organism:Homo sapiens (Human)
Description:P48730
Residue:415
BDBM50008365
NameBDBM50008365
Synonyms:CHEMBL3235185
TypeSmall organic molecule
Emp. Form.C14H12N2O3S3
Mol. Mass.352.452
SMILESCS(=O)(=O)c1ccc2nc(NC(=O)Cc3cccs3)sc2c1