Reaction Details
TargetCasein kinase I isoform delta
LigandBDBM50008390
Substrate/Competitorn/a
Meas. Tech.ChEMBL_1334961 (CHEMBL3239314)
IC50 1120±n/a nM
Citation Salado, IGRedondo, MBello, MLPerez, CLiachko, NFKraemer, BCMiguel, LLecourtois, MGil, CMartinez, APerez, DI Protein kinase CK-1 inhibitors as new potential drugs for amyotrophic lateral sclerosis. J Med Chem57:2755-72 (2014) 
 
Casein kinase I isoform delta
Name:Casein kinase I isoform delta
Type:Enzyme
Mol. Mass.:47356.76
Organism:Homo sapiens (Human)
Description:P48730
Residue:415
BDBM50008390
NameBDBM50008390
Synonyms:CHEMBL3235188
TypeSmall organic molecule
Emp. Form.C14H13ClN2O2S
Mol. Mass.308.783
SMILESCC(=O)c1sc(NC(=O)Cc2cccc(Cl)c2)nc1C