Reaction Details
TargetCasein kinase I isoform delta
LigandBDBM50008394
Substrate/Competitorn/a
Meas. Tech.ChEMBL_1334961 (CHEMBL3239314)
IC50 2820±n/a nM
Citation Salado, IGRedondo, MBello, MLPerez, CLiachko, NFKraemer, BCMiguel, LLecourtois, MGil, CMartinez, APerez, DI Protein kinase CK-1 inhibitors as new potential drugs for amyotrophic lateral sclerosis. J Med Chem57:2755-72 (2014) 
 
Casein kinase I isoform delta
Name:Casein kinase I isoform delta
Type:Enzyme
Mol. Mass.:47356.76
Organism:Homo sapiens (Human)
Description:P48730
Residue:415
BDBM50008394
NameBDBM50008394
Synonyms:CHEMBL3235531
TypeSmall organic molecule
Emp. Form.C23H20N2O2S
Mol. Mass.388.482
SMILESCCOc1ccc2nc(NC(=O)C(c3ccccc3)c3ccccc3)sc2c1