Reaction Details
TargetCasein kinase I isoform delta
LigandBDBM50008406
Substrate/Competitorn/a
Meas. Tech.ChEMBL_1334961 (CHEMBL3239314)
IC50 68±n/a nM
Citation Salado, IGRedondo, MBello, MLPerez, CLiachko, NFKraemer, BCMiguel, LLecourtois, MGil, CMartinez, APerez, DI Protein kinase CK-1 inhibitors as new potential drugs for amyotrophic lateral sclerosis. J Med Chem57:2755-72 (2014) 
 
Casein kinase I isoform delta
Name:Casein kinase I isoform delta
Type:Enzyme
Mol. Mass.:47356.76
Organism:Homo sapiens (Human)
Description:P48730
Residue:415
BDBM50008406
NameBDBM50008406
Synonyms:CHEMBL3235542
TypeSmall organic molecule
Emp. Form.C16H10ClF3N2OS
Mol. Mass.370.777
SMILESFC(F)(F)c1ccc2nc(NC(=O)Cc3ccccc3Cl)sc2c1