Reaction Details
TargetCasein kinase I isoform delta
LigandBDBM49375
Substrate/Competitorn/a
Meas. Tech.ChEMBL_1334961 (CHEMBL3239314)
IC50 330±n/a nM
Citation Salado, IGRedondo, MBello, MLPerez, CLiachko, NFKraemer, BCMiguel, LLecourtois, MGil, CMartinez, APerez, DI Protein kinase CK-1 inhibitors as new potential drugs for amyotrophic lateral sclerosis. J Med Chem57:2755-72 (2014) 
 
Casein kinase I isoform delta
Name:Casein kinase I isoform delta
Type:Enzyme
Mol. Mass.:47356.76
Organism:Homo sapiens (Human)
Description:P48730
Residue:415
BDBM49375
NameBDBM49375
Synonyms:MLS000527505 N-(1,3-benzothiazol-2-yl)-2-phenyl-ethanamide N-Benzothiazol-2-yl-2-phenyl-acetamide cid_591403
TypeSmall organic molecule
Emp. Form.C15H12N2OS
Mol. Mass.268.334
SMILESO=C(Cc1ccccc1)Nc1nc2ccccc2s1