Reaction Details
TargetCasein kinase I isoform delta
LigandBDBM50008505
Substrate/Competitorn/a
Meas. Tech.ChEMBL_1334961 (CHEMBL3239314)
IC50 1240±n/a nM
Citation Salado, IGRedondo, MBello, MLPerez, CLiachko, NFKraemer, BCMiguel, LLecourtois, MGil, CMartinez, APerez, DI Protein kinase CK-1 inhibitors as new potential drugs for amyotrophic lateral sclerosis. J Med Chem57:2755-72 (2014) 
 
Casein kinase I isoform delta
Name:Casein kinase I isoform delta
Type:Enzyme
Mol. Mass.:47356.76
Organism:Homo sapiens (Human)
Description:P48730
Residue:415
BDBM50008505
NameBDBM50008505
Synonyms:CHEMBL3235565
TypeSmall organic molecule
Emp. Form.C16H12Cl2N2O2S
Mol. Mass.367.25
SMILESCOc1ccc2nc(NC(=O)Cc3ccc(Cl)c(Cl)c3)sc2c1