Reaction Details
TargetCasein kinase I isoform delta
LigandBDBM50008509
Substrate/Competitorn/a
Meas. Tech.ChEMBL_1334961 (CHEMBL3239314)
IC50 79±n/a nM
Citation Salado, IGRedondo, MBello, MLPerez, CLiachko, NFKraemer, BCMiguel, LLecourtois, MGil, CMartinez, APerez, DI Protein kinase CK-1 inhibitors as new potential drugs for amyotrophic lateral sclerosis. J Med Chem57:2755-72 (2014) 
 
Casein kinase I isoform delta
Name:Casein kinase I isoform delta
Type:Enzyme
Mol. Mass.:47356.76
Organism:Homo sapiens (Human)
Description:P48730
Residue:415
BDBM50008509
NameBDBM50008509
Synonyms:CHEMBL3235569
TypeSmall organic molecule
Emp. Form.C19H17F3N2O5S
Mol. Mass.442.409
SMILESCOc1cc(CC(=O)Nc2nc3ccc(OC(F)(F)F)cc3s2)cc(OC)c1OC