Reaction Details
TargetCasein kinase I isoform delta
LigandBDBM50008514
Substrate/Competitorn/a
Meas. Tech.ChEMBL_1334961 (CHEMBL3239314)
IC50 430±n/a nM
Citation Salado, IGRedondo, MBello, MLPerez, CLiachko, NFKraemer, BCMiguel, LLecourtois, MGil, CMartinez, APerez, DI Protein kinase CK-1 inhibitors as new potential drugs for amyotrophic lateral sclerosis. J Med Chem57:2755-72 (2014) 
 
Casein kinase I isoform delta
Name:Casein kinase I isoform delta
Type:Enzyme
Mol. Mass.:47356.76
Organism:Homo sapiens (Human)
Description:P48730
Residue:415
BDBM50008514
NameBDBM50008514
Synonyms:CHEMBL3235573
TypeSmall organic molecule
Emp. Form.C16H17F3N2OS
Mol. Mass.342.379
SMILESFC(F)(F)c1ccc2nc(NC(=O)CC3CCCCC3)sc2c1