Reaction Details
TargetCasein kinase I isoform delta
LigandBDBM50008515
Substrate/Competitorn/a
Meas. Tech.ChEMBL_1334961 (CHEMBL3239314)
IC50 460±n/a nM
Citation Salado, IGRedondo, MBello, MLPerez, CLiachko, NFKraemer, BCMiguel, LLecourtois, MGil, CMartinez, APerez, DI Protein kinase CK-1 inhibitors as new potential drugs for amyotrophic lateral sclerosis. J Med Chem57:2755-72 (2014) 
 
Casein kinase I isoform delta
Name:Casein kinase I isoform delta
Type:Enzyme
Mol. Mass.:47356.76
Organism:Homo sapiens (Human)
Description:P48730
Residue:415
BDBM50008515
NameBDBM50008515
Synonyms:CHEMBL3235574
TypeSmall organic molecule
Emp. Form.C14H15F3N2OS
Mol. Mass.316.342
SMILESCC(C)(C)CC(=O)Nc1nc2ccc(cc2s1)C(F)(F)F