Reaction Details
TargetSodium channel protein type 1 subunit alpha
LigandBDBM50008745
Substrate/Competitorn/a
Meas. Tech.ChEMBL_1336341 (CHEMBL3242049)
IC50 15300±n/a nM
Citation Browne, LLidster, KAl-Izki, SClutterbuck, LPosada, CChan, AWRiddall, DGarthwaite, JBaker, DSelwood, DL Imidazol-1-ylethylindazole voltage-gated sodium channel ligands are neuroprotective during optic neuritis in a mouse model of multiple sclerosis. J Med Chem57:2942-52 (2014) 
 
Sodium channel protein type 1 subunit alpha
Name:Sodium channel protein type 1 subunit alpha
Type:Protein
Mol. Mass.:228952.47
Organism:Homo sapiens (Human)
Description:P35498
Residue:2009
BDBM50008745
NameBDBM50008745
Synonyms:CHEMBL3236329
TypeSmall organic molecule
Emp. Form.C23H18F3N7O3
Mol. Mass.497.4293
SMILESFC(F)(F)Oc1cccc(c1)C(=O)NCc1noc(n1)-c1n(CCn2ccnc2)nc2ccccc12