Reaction Details
TargetSodium channel protein type 2 subunit alpha
LigandBDBM50008745
Substrate/Competitorn/a
Meas. Tech.ChEMBL_1336348 (CHEMBL3242056)
IC50 3540±n/a nM
Citation Browne, LLidster, KAl-Izki, SClutterbuck, LPosada, CChan, AWRiddall, DGarthwaite, JBaker, DSelwood, DL Imidazol-1-ylethylindazole voltage-gated sodium channel ligands are neuroprotective during optic neuritis in a mouse model of multiple sclerosis. J Med Chem57:2942-52 (2014) 
 
Sodium channel protein type 2 subunit alpha
Name:Sodium channel protein type 2 subunit alpha
Type:Enzyme
Mol. Mass.:227954.68
Organism:Homo sapiens (Human)
Description:Q99250
Residue:2005
BDBM50008745
NameBDBM50008745
Synonyms:CHEMBL3236329
TypeSmall organic molecule
Emp. Form.C23H18F3N7O3
Mol. Mass.497.4293
SMILESFC(F)(F)Oc1cccc(c1)C(=O)NCc1noc(n1)-c1n(CCn2ccnc2)nc2ccccc12