Reaction Details
TargetCytochrome P450 3A4
LigandBDBM50448936
Substrate/Competitorn/a
Meas. Tech.ChEMBL_1336778 (CHEMBL3241317)
IC50>27000±n/a nM
Citation Gonzalez, AZLi, ZBeck, HPCanon, JChen, AChow, DDuquette, JEksterowicz, JFox, BMFu, JHuang, XHouze, JJin, LLi, YLing, YLo, MCLong, AMMcGee, LRMcIntosh, JOliner, JDOsgood, TRew, YSaiki, AYShaffer, PWortman, SYakowec, PYan, XYe, QYu, DZhao, XZhou, JOlson, SHSun, DMedina, JC Novel inhibitors of the MDM2-p53 interaction featuring hydrogen bond acceptors as carboxylic acid isosteres. J Med Chem57:2963-88 (2014) 
 
Cytochrome P450 3A4
Name:Cytochrome P450 3A4
Type:Enzyme
Mol. Mass.:57349.57
Organism:Homo sapiens (Human)
Description:n/a
Residue:503
BDBM50448936
NameBDBM50448936
Synonyms:CHEMBL3125527 US9593129, Example 342
TypeSmall organic molecule
Emp. Form.C28H35Cl2NO5S
Mol. Mass.568.552
SMILESCC[C@@H](CS(=O)(=O)C(C)(C)C)N1[C@@H]([C@H](C[C@](C)(CC(O)=O)C1=O)c1cccc(Cl)c1)c1ccc(Cl)cc1