Reaction Details
TargetDelta-type opioid receptor
LigandBDBM50008837
Substrate/Competitorn/a
Meas. Tech.ChEMBL_1337157 (CHEMBL3240188)
IC50 0.220000±n/a nM
Citation Bai, LLi, ZChen, JChung, NNWilkes, BCLi, TSchiller, PW [Dmt(1)]DALDA analogues with enhancedµ opioid agonist potency and with a mixedµ/¿ opioid activity profile. Bioorg Med Chem22:2333-8 (2014) 
 
Delta-type opioid receptor
Name:Delta-type opioid receptor
Type:Enzyme Catalytic Domain
Mol. Mass.:40577.25
Organism:MOUSE
Description:P32300
Residue:372
BDBM50008837
NameBDBM50008837
Synonyms:CHEMBL3236674
TypeSmall organic molecule
Emp. Form.C35H54N8O6
Mol. Mass.682.8533
SMILESCCc1cccc(C)c1C[C@H](NC(=O)[C@@H](CCCNC(N)=N)NC(=O)[C@@H](N)Cc1c(C)cc(O)cc1C)C(=O)N[C@@H](CCCCN)C(O)=O