Reaction Details
TargetCD44 antigen
LigandBDBM13016
Substrate/Competitorn/a
Meas. Tech.ChEMBL_1337579 (CHEMBL3242488)
Kd 6900000±n/a nM
Citation Liu, LKFinzel, BC Fragment-based identification of an inducible binding site on cell surface receptor CD44 for the design of protein-carbohydrate interaction inhibitors. J Med Chem57:2714-25 (2014) 
 
CD44 antigen
Name:CD44 antigen
Type:PROTEIN
Mol. Mass.:81511.49
Organism:Homo sapiens (Human)
Description:ChEMBL_108280
Residue:742
BDBM13016
NameBDBM13016
Synonyms:1,2,3,4-tetrahydroisoquinoline THIQ 6 | tetrahydroisoquinoline
TypeSmall organic molecule
Emp. Form.C9H11N
Mol. Mass.133.1903
SMILESC1Cc2ccccc2CN1