Reaction Details
TargetCD44 antigen
LigandBDBM50008913
Substrate/Competitorn/a
Meas. Tech.ChEMBL_1337580 (CHEMBL3242489)
Kd 6400000±n/a nM
Citation Liu, LKFinzel, BC Fragment-based identification of an inducible binding site on cell surface receptor CD44 for the design of protein-carbohydrate interaction inhibitors. J Med Chem57:2714-25 (2014) 
 
CD44 antigen
Name:CD44 antigen
Type:PROTEIN
Mol. Mass.:85579.86
Organism:Mus musculus
Description:ChEMBL_108281
Residue:778
BDBM50008913
NameBDBM50008913
Synonyms:CHEMBL3183504
TypeSmall organic molecule
Emp. Form.C7H10N2
Mol. Mass.122.1677
SMILESCc1cccc(N)c1N