Reaction Details
TargetCD44 antigen
LigandBDBM50008910
Substrate/Competitorn/a
Meas. Tech.ChEMBL_1337581 (CHEMBL3242490)
IC50 65000±n/a nM
Citation Liu, LKFinzel, BC Fragment-based identification of an inducible binding site on cell surface receptor CD44 for the design of protein-carbohydrate interaction inhibitors. J Med Chem57:2714-25 (2014) 
 
CD44 antigen
Name:CD44 antigen
Type:PROTEIN
Mol. Mass.:81511.49
Organism:Homo sapiens (Human)
Description:ChEMBL_108280
Residue:742
BDBM50008910
NameBDBM50008910
Synonyms:CHEMBL3237621
TypeSmall organic molecule
Emp. Form.C56H86N4O45
Mol. Mass.1535.2818
SMILES[H][C@@]1(O[C@H]2[C@H](O)[C@@H](CO)O[C@@]([H])(O[C@H]3[C@H](O)[C@@H](O)[C@]([H])(O[C@H]4[C@H](O)[C@@H](CO)O[C@@]([H])(O[C@H]5[C@H](O)[C@@H](O)[C@]([H])(O[C@H]6[C@H](O)[C@@H](CO)O[C@@]([H])(O[C@H]7[C@H](O)[C@@H](O)[C@H](O)O[C@@H]7C(O)=O)[C@@H]6NC(C)=O)O[C@@H]5C(O)=O)[C@@H]4NC(C)=O)O[C@@H]3C(O)=O)[C@@H]2NC(C)=O)O[C@@H]([C@@H](O[C@]2([H])O[C@H](CO)[C@@H](O)[C@H](O)[C@H]2NC(C)=O)[C@H](O)[C@H]1O)C(O)=O