Reaction Details
TargetPlasminogen
LigandBDBM50009205
Substrate/Competitorn/a
Meas. Tech.ChEMBL_1338844 (CHEMBL3242934)
IC50 510000±n/a nM
Citation Teno, NGohda, KWanaka, KTsuda, YSueda, TYamashita, YOtsubo, T Pyrrolopyrimidine-inhibitors with hydantoin moiety as spacer can explore P4/S4 interaction on plasmin. Bioorg Med Chem22:2339-52 (2014) 
 
Plasminogen
Name:Plasminogen
Type:Enzyme
Mol. Mass.:90579.18
Organism:Homo sapiens (Human)
Description:n/a
Residue:810
BDBM50009205
NameBDBM50009205
Synonyms:CHEMBL3238379
TypeSmall organic molecule
Emp. Form.C31H31N9O5
Mol. Mass.609.6351
SMILESCn1c(CN2C(=O)CN(C2=O)c2ccc(Oc3ccccc3)c(c2)C(N)=O)cc2cnc(nc12)C(=O)N[C@@H](CCCCN)C#N