Reaction Details
TargetPlasma kallikrein
LigandBDBM50009188
Substrate/Competitorn/a
Meas. Tech.ChEMBL_1338845 (CHEMBL3242935)
IC50>1000000±n/a nM
Citation Teno, NGohda, KWanaka, KTsuda, YSueda, TYamashita, YOtsubo, T Pyrrolopyrimidine-inhibitors with hydantoin moiety as spacer can explore P4/S4 interaction on plasmin. Bioorg Med Chem22:2339-52 (2014) 
 
Plasma kallikrein
Name:Plasma kallikrein
Type:Protein
Mol. Mass.:71391.16
Organism:Homo sapiens (Human)
Description:P03952
Residue:638
BDBM50009188
NameBDBM50009188
Synonyms:CHEMBL3238371
TypeSmall organic molecule
Emp. Form.C27H30N8O5
Mol. Mass.546.5777
SMILESCC(=O)COc1ccc(cc1)N1CC(=O)N(Cc2cc3cnc(nc3n2C)C(=O)N[C@@H](CCCCN)C#N)C1=O