Reaction Details
TargetPlasma kallikrein
LigandBDBM50009204
Substrate/Competitorn/a
Meas. Tech.ChEMBL_1338845 (CHEMBL3242935)
IC50>1000000±n/a nM
Citation Teno, NGohda, KWanaka, KTsuda, YSueda, TYamashita, YOtsubo, T Pyrrolopyrimidine-inhibitors with hydantoin moiety as spacer can explore P4/S4 interaction on plasmin. Bioorg Med Chem22:2339-52 (2014) 
 
Plasma kallikrein
Name:Plasma kallikrein
Type:Protein
Mol. Mass.:71391.16
Organism:Homo sapiens (Human)
Description:P03952
Residue:638
BDBM50009204
NameBDBM50009204
Synonyms:CHEMBL3238378
TypeSmall organic molecule
Emp. Form.C31H31N9O5
Mol. Mass.609.6351
SMILESCn1c(CN2C(=O)CN(C2=O)c2ccc(Oc3ccccc3C(N)=O)cc2)cc2cnc(nc12)C(=O)N[C@@H](CCCCN)C#N