Reaction Details
TargetUrokinase-type plasminogen activator
LigandBDBM50009188
Substrate/Competitorn/a
Meas. Tech.ChEMBL_1338846 (CHEMBL3242936)
IC50>1000000±n/a nM
Citation Teno, NGohda, KWanaka, KTsuda, YSueda, TYamashita, YOtsubo, T Pyrrolopyrimidine-inhibitors with hydantoin moiety as spacer can explore P4/S4 interaction on plasmin. Bioorg Med Chem22:2339-52 (2014) 
 
Urokinase-type plasminogen activator
Name:Urokinase-type plasminogen activator
Type:Enzyme
Mol. Mass.:48528.62
Organism:Homo sapiens (Human)
Description:P00749
Residue:431
BDBM50009188
NameBDBM50009188
Synonyms:CHEMBL3238371
TypeSmall organic molecule
Emp. Form.C27H30N8O5
Mol. Mass.546.5777
SMILESCC(=O)COc1ccc(cc1)N1CC(=O)N(Cc2cc3cnc(nc3n2C)C(=O)N[C@@H](CCCCN)C#N)C1=O