Reaction Details
TargetUrokinase-type plasminogen activator
LigandBDBM50009197
Substrate/Competitorn/a
Meas. Tech.ChEMBL_1338846 (CHEMBL3242936)
IC50>1000000±n/a nM
Citation Teno, NGohda, KWanaka, KTsuda, YSueda, TYamashita, YOtsubo, T Pyrrolopyrimidine-inhibitors with hydantoin moiety as spacer can explore P4/S4 interaction on plasmin. Bioorg Med Chem22:2339-52 (2014) 
 
Urokinase-type plasminogen activator
Name:Urokinase-type plasminogen activator
Type:Enzyme
Mol. Mass.:48528.62
Organism:Homo sapiens (Human)
Description:P00749
Residue:431
BDBM50009197
NameBDBM50009197
Synonyms:CHEMBL3238372
TypeSmall organic molecule
Emp. Form.C26H29N9O5
Mol. Mass.547.5658
SMILESCn1c(CN2C(=O)CN(C2=O)c2ccc(OCC(N)=O)cc2)cc2cnc(nc12)C(=O)N[C@@H](CCCCN)C#N