Reaction Details
TargetDelta-type opioid receptor
LigandBDBM50009267
Substrate/Competitorn/a
Meas. Tech.ChEMBL_1335007 (CHEMBL3239394)
IC50>10000±n/a nM
Citation Cai, JSong, BCai, YMa, YLam, ALMagiera, JSekar, SWyse, BDAmbo, ASasaki, YLazarus, LHSmith, MTLi, T Endomorphin analogues with mixedµ-opioid (MOP) receptor agonism/d-opioid (DOP) receptor antagonism and lackingß-arrestin2 recruitment activity. Bioorg Med Chem22:2208-19 (2014) 
 
Delta-type opioid receptor
Name:Delta-type opioid receptor
Type:Enzyme Catalytic Domain
Mol. Mass.:40577.25
Organism:MOUSE
Description:P32300
Residue:372
BDBM50009267
NameBDBM50009267
Synonyms:CHEMBL3233196
TypeSmall organic molecule
Emp. Form.C40H53N5O5
Mol. Mass.683.8793
SMILESCc1cc(C)c(C[C@H](NC(=O)[C@H](Cc2c(C)cc(C)cc2C)NC(=O)[C@@H]2CCCN2C(=O)[C@@H](N)Cc2c(C)cc(O)cc2C)C(N)=O)c(C)c1