Reaction Details
TargetMu-type opioid receptor
LigandBDBM50009268
Substrate/Competitorn/a
Meas. Tech.ChEMBL_1335015 (CHEMBL3239402)
EC50 6.3±n/a nM
Citation Cai, JSong, BCai, YMa, YLam, ALMagiera, JSekar, SWyse, BDAmbo, ASasaki, YLazarus, LHSmith, MTLi, T Endomorphin analogues with mixedµ-opioid (MOP) receptor agonism/d-opioid (DOP) receptor antagonism and lackingß-arrestin2 recruitment activity. Bioorg Med Chem22:2208-19 (2014) 
 
Mu-type opioid receptor
Name:Mu-type opioid receptor
Type:G Protein-Coupled Receptor (GPCR)
Mol. Mass.:44789.51
Organism:Homo sapiens (Human)
Description:P35372
Residue:400
BDBM50009268
NameBDBM50009268
Synonyms:CHEMBL3233197
TypeSmall organic molecule
Emp. Form.C27H33N5O4
Mol. Mass.491.582
SMILESCc1cc(O)cc(C)c1C[C@H](N)C(=O)N1CCC[C@H]1C(=O)N[C@@H](Cc1c[nH]c2ccccc12)C(N)=O