Reaction Details
TargetDelta-type opioid receptor
LigandBDBM50166065
Substrate/Competitorn/a
Meas. Tech.ChEMBL_1335003 (CHEMBL3239390)
Ki 25±n/a nM
Citation Cai, JSong, BCai, YMa, YLam, ALMagiera, JSekar, SWyse, BDAmbo, ASasaki, YLazarus, LHSmith, MTLi, T Endomorphin analogues with mixedµ-opioid (MOP) receptor agonism/d-opioid (DOP) receptor antagonism and lackingß-arrestin2 recruitment activity. Bioorg Med Chem22:2208-19 (2014) 
 
Delta-type opioid receptor
Name:Delta-type opioid receptor
Type:G Protein-Coupled Receptor (GPCR)
Mol. Mass.:40465.04
Organism:Rattus norvegicus (rat)
Description:Competition binding assays were using CHO-K1 cell membranes expressing the opioid receptor.
Residue:372
BDBM50166065
NameBDBM50166065
Synonyms:(S)-1-[(S)-2-Amino-3-(4-hydroxy-2,6-dimethyl-phenyl)-propionyl]-pyrrolidine-2-carboxylic acid {(S)-1-[(S)-1-carbamoyl-2-(1H-indol-3-yl)-ethylcarbamoyl]-2-phenyl-ethyl}-amide | CHEMBL365983
TypeSmall organic molecule
Emp. Form.C36H42N6O5
Mol. Mass.638.7559
SMILESCc1cc(O)cc(C)c1C[C@H](N)C(=O)N1CCC[C@H]1C(=O)N[C@@H](Cc1ccccc1)C(=O)N[C@@H](Cc1c[nH]c2ccccc12)C(N)=O