Reaction Details
TargetGonadotropin-releasing hormone receptor
LigandBDBM50261184
Substrate/Competitorn/a
Meas. Tech.ChEMBL_1335046 (CHEMBL3239477)
Ki 2.2±n/a nM
Citation Olberg, DEAndressen, KWLevy, FOKlaveness, JHaraldsen, ISutcliffe, JL Synthesis and in vitro evaluation of small-molecule [18F] labeled gonadotropin-releasing hormone (GnRH) receptor antagonists as potential PET imaging agents for GnRH receptor expression. Bioorg Med Chem Lett24:1846-50 (2014) 
 
Gonadotropin-releasing hormone receptor
Name:Gonadotropin-releasing hormone receptor
Type:PROTEIN
Mol. Mass.:37702.59
Organism:Mus musculus
Description:ChEMBL_108267
Residue:327
BDBM50261184
NameBDBM50261184
Synonyms:5-((3,5,5,8,8-pentamethyl-5,6,7,8-tetrahydronaphthalen-2-yl)methyl)-N-(2,4,6-trimethoxyphenyl)furan-2-carboxamide | CHEMBL494803
TypeSmall organic molecule
Emp. Form.C30H37NO5
Mol. Mass.491.6185
SMILESCOc1cc(OC)c(NC(=O)c2ccc(Cc3cc4c(cc3C)C(C)(C)CCC4(C)C)o2)c(OC)c1