Reaction Details
TargetProlyl endopeptidase FAP
LigandBDBM50434188
Substrate/Competitorn/a
Meas. Tech.ChEMBL_1335495 (CHEMBL3239280)
IC50 10±n/a nM
Citation Jansen, KHeirbaut, LVerkerk, RCheng, JDJoossens, JCos, PMaes, LLambeir, AMDe Meester, IAugustyns, KVan der Veken, P Extended structure-activity relationship and pharmacokinetic investigation of (4-quinolinoyl)glycyl-2-cyanopyrrolidine inhibitors of fibroblast activation protein (FAP). J Med Chem57:3053-74 (2014) 
 
Prolyl endopeptidase FAP
Name:Prolyl endopeptidase FAP
Type:Enzyme
Mol. Mass.:87949.14
Organism:Mus musculus (Mouse)
Description:P97321
Residue:761
BDBM50434188
NameBDBM50434188
Synonyms:CHEMBL2385281 | US9346814, Cmpd No 2 Example 3
TypeSmall organic molecule
Emp. Form.C17H16N4O2
Mol. Mass.308.3345
SMILESO=C(CNC(=O)c1ccnc2ccccc12)N1CCC[C@H]1C#N