Reaction Details
TargetDipeptidyl peptidase 4
LigandBDBM50050513
Substrate/Competitorn/a
Meas. Tech.ChEMBL_1335496 (CHEMBL3239281)
IC50 22±n/a nM
Citation Jansen, KHeirbaut, LVerkerk, RCheng, JDJoossens, JCos, PMaes, LLambeir, AMDe Meester, IAugustyns, KVan der Veken, P Extended structure-activity relationship and pharmacokinetic investigation of (4-quinolinoyl)glycyl-2-cyanopyrrolidine inhibitors of fibroblast activation protein (FAP). J Med Chem57:3053-74 (2014) 
 
Dipeptidyl peptidase 4
Name:Dipeptidyl peptidase 4
Type:Enzyme
Mol. Mass.:88271.01
Organism:Homo sapiens (Human)
Description:P27487
Residue:766
BDBM50050513
NameBDBM50050513
Synonyms:(R)-1-((S)-2-amino-3-methylbutanoyl)pyrrolidin-2-ylboronic acid (S)-2-Amino-3-methyl-2-boronic acid-1-pyrrolidin-1-yl-butan-1-one CHEMBL67279 Pyrrolidine derivative US11504364, Compound Val-boroPro US11707539, Compound 2054
TypeSmall organic molecule
Emp. Form.C9H19BN2O3
Mol. Mass.214.07
SMILESCC(C)[C@H](N)C(=O)N1CCC[C@H]1B(O)O