Reaction Details
Target5-hydroxytryptamine receptor 2A
LigandBDBM50009383
Substrate/Competitorn/a
Meas. Tech.ChEMBL_1335963 (CHEMBL3239084)
Ki 4.1±n/a nM
Citation Wang, SChen, YZhao, SXu, XLiu, XLiu, BFZhang, G Synthesis and biological evaluation of a series of benzoxazole/benzothiazole-containing 2,3-dihydrobenzo[b][1,4]dioxine derivatives as potential antidepressants. Bioorg Med Chem Lett24:1766-70 (2014) 
 
5-hydroxytryptamine receptor 2A
Name:5-hydroxytryptamine receptor 2A
Type:G Protein-Coupled Receptor (GPCR)
Mol. Mass.:52852.05
Organism:Rattus norvegicus (rat)
Description:Rat cortex membranes 5-HT2A receptors.
Residue:471
BDBM50009383
NameBDBM50009383
Synonyms:CHEMBL3233865
TypeSmall organic molecule
Emp. Form.C30H32N2O4
Mol. Mass.484.5861
SMILESC(COCC1Oc2ccccc2OC1c1ccccc1)CN1CCC(CC1)c1nc2ccccc2o1