Reaction Details
TargetDiacylglycerol O-acyltransferase 1
LigandBDBM50385398
Substrate/Competitorn/a
Meas. Tech.ChEMBL_1335970 (CHEMBL3239091)
IC50 36±n/a nM
Citation Zhou, GTing, PCWishart, GZorn, NAslanian, RGLin, MSmith, MWalker, SSCook, JVan Heek, MLachowicz, J Discovery of novel quinoline carboxylic acid series as DGAT1 inhibitors. Bioorg Med Chem Lett24:1790-4 (2014) 
 
Diacylglycerol O-acyltransferase 1
Name:Diacylglycerol O-acyltransferase 1
Type:Protein
Mol. Mass.:55297.82
Organism:Homo sapiens (Human)
Description:O75907
Residue:488
BDBM50385398
NameBDBM50385398
Synonyms:CHEMBL2036730
TypeSmall organic molecule
Emp. Form.C23H22F2N4O4
Mol. Mass.456.442
SMILESOC(=O)C[C@H]1CC[C@@H](CC1)c1ccc(NC(=O)c2nnc(Nc3ccc(F)c(F)c3)o2)cc1