Reaction Details
TargetChromobox protein homolog 7
LigandBDBM50009455
Substrate/Competitorn/a
Meas. Tech.ChEMBL_1336411 (CHEMBL3242415)
IC50 6800±n/a nM
Citation Simhadri, CDaze, KDDouglas, SFQuon, TTDev, AGignac, MCPeng, FHeller, MBoulanger, MJWulff, JEHof, F Chromodomain antagonists that target the polycomb-group methyllysine reader protein chromobox homolog 7 (CBX7). J Med Chem57:2874-83 (2014) 
 
Chromobox protein homolog 7
Name:Chromobox protein homolog 7
Type:Protein
Mol. Mass.:28351.76
Organism:Homo sapiens (Human)
Description:n/a
Residue:251
BDBM50009455
NameBDBM50009455
Synonyms:CHEMBL3234137
TypeSmall organic molecule
Emp. Form.C31H52N7O7
Mol. Mass.634.7867
SMILESCC(C)[C@H](NC(=O)[C@H](C)NC(=O)[C@H](Cc1ccccc1)NC(C)=O)C(=O)N[C@@H](CCCC[N+](C)(C)C)C(=O)N[C@@H](CO)C(N)=O