Reaction Details
TargetChromobox protein homolog 7
LigandBDBM50009468
Substrate/Competitorn/a
Meas. Tech.ChEMBL_1336411 (CHEMBL3242415)
IC50 6000±n/a nM
Citation Simhadri, CDaze, KDDouglas, SFQuon, TTDev, AGignac, MCPeng, FHeller, MBoulanger, MJWulff, JEHof, F Chromodomain antagonists that target the polycomb-group methyllysine reader protein chromobox homolog 7 (CBX7). J Med Chem57:2874-83 (2014) 
 
Chromobox protein homolog 7
Name:Chromobox protein homolog 7
Type:Protein
Mol. Mass.:28351.76
Organism:Homo sapiens (Human)
Description:n/a
Residue:251
BDBM50009468
NameBDBM50009468
Synonyms:CHEMBL3234150
TypeSmall organic molecule
Emp. Form.C33H54N7O7
Mol. Mass.660.824
SMILESC[C@H](NC(=O)[C@H](Cc1ccccc1)NC(C)=O)C(=O)N[C@@H](C1CCCC1)C(=O)N[C@@H](CCCC[N+](C)(C)C)C(=O)N[C@@H](CO)C(N)=O