Reaction Details
TargetChromobox protein homolog 7
LigandBDBM50009504
Substrate/Competitorn/a
Meas. Tech.ChEMBL_1336411 (CHEMBL3242415)
IC50>2000000±n/a nM
Citation Simhadri, CDaze, KDDouglas, SFQuon, TTDev, AGignac, MCPeng, FHeller, MBoulanger, MJWulff, JEHof, F Chromodomain antagonists that target the polycomb-group methyllysine reader protein chromobox homolog 7 (CBX7). J Med Chem57:2874-83 (2014) 
 
Chromobox protein homolog 7
Name:Chromobox protein homolog 7
Type:Protein
Mol. Mass.:28351.76
Organism:Homo sapiens (Human)
Description:n/a
Residue:251
BDBM50009504
NameBDBM50009504
Synonyms:CHEMBL3234186
TypeSmall organic molecule
Emp. Form.C29H49N6O7
Mol. Mass.593.7348
SMILESCC(C)C[C@H](NC(=O)[C@H](C)NCc1ccc(cc1)C(O)=O)C(=O)N[C@@H](CCCC[N+](C)(C)C)C(=O)N[C@@H](CO)C(N)=O