Reaction Details
TargetChromobox protein homolog 8
LigandBDBM50009463
Substrate/Competitorn/a
Meas. Tech.ChEMBL_1336413 (CHEMBL3242417)
Kd 12300±n/a nM
Citation Simhadri, CDaze, KDDouglas, SFQuon, TTDev, AGignac, MCPeng, FHeller, MBoulanger, MJWulff, JEHof, F Chromodomain antagonists that target the polycomb-group methyllysine reader protein chromobox homolog 7 (CBX7). J Med Chem57:2874-83 (2014) 
 
Chromobox protein homolog 8
Name:Chromobox protein homolog 8
Type:PROTEIN
Mol. Mass.:43415.86
Organism:Homo sapiens (Human)
Description:ChEMBL_108272
Residue:389
BDBM50009463
NameBDBM50009463
Synonyms:CHEMBL3234145
TypeSmall organic molecule
Emp. Form.C35H52N7O8
Mol. Mass.698.8289
SMILESC[C@H](NC(=O)[C@H](Cc1ccccc1)NC(C)=O)C(=O)N[C@@H](Cc1ccc(O)cc1)C(=O)N[C@@H](CCCC[N+](C)(C)C)C(=O)N[C@@H](CO)C(N)=O