Reaction Details
TargetChromobox protein homolog 8
LigandBDBM50009554
Substrate/Competitorn/a
Meas. Tech.ChEMBL_1336413 (CHEMBL3242417)
Kd 1780±n/a nM
Citation Simhadri, CDaze, KDDouglas, SFQuon, TTDev, AGignac, MCPeng, FHeller, MBoulanger, MJWulff, JEHof, F Chromodomain antagonists that target the polycomb-group methyllysine reader protein chromobox homolog 7 (CBX7). J Med Chem57:2874-83 (2014) 
 
Chromobox protein homolog 8
Name:Chromobox protein homolog 8
Type:PROTEIN
Mol. Mass.:43415.86
Organism:Homo sapiens (Human)
Description:ChEMBL_108272
Residue:389
BDBM50009554
NameBDBM50009554
Synonyms:CHEMBL3234442
TypeSmall organic molecule
Emp. Form.C40H58N7O9
Mol. Mass.780.9295
SMILESCOC(=O)c1ccc(cc1)C(=O)N[C@@H](Cc1ccccc1)C(=O)N[C@@H](C)C(=O)N[C@@H](C1CCCC1)C(=O)N[C@@H](CCCC[N+](C)(C)C)C(=O)N[C@H](CO)C(N)=O