Reaction Details
TargetPyridoxal kinase
LigandBDBM50009721
Substrate/Competitorn/a
Meas. Tech.ChEMBL_1346040 (CHEMBL3258489)
Ki 68100±n/a nM
Citation Korytnyk, WPotti, PG Antagonists of vitamin B6. Simultaneous and stepwise modification of the 2 and 4 positions. J Med Chem20:1-5 (1977) Pyridoxal kinase
Name:Pyridoxal kinase
Type:PROTEIN
Mol. Mass.:35099.40
Organism:Homo sapiens (Human)
Description:ChEMBL_103125
Residue:312
BDBM50009721
NameBDBM50009721
Synonyms:CHEMBL3244690
TypeSmall organic molecule
Emp. Form.C9H12ClNO2
Mol. Mass.201.65
SMILESCl.Cc1c(CO)cnc(C=C)c1O