Reaction Details
TargetPlasminogen
LigandBDBM50038002
Substrate/Competitorn/a
Meas. Tech.ChEMBL_1340125 (CHEMBL3256271)
Ki 500000±n/a nM
Citation Andrews, JMRoman, DPBing, DH Inhibition of four human serine proteases by substituted benzamidines. J Med Chem21:1202-7 (1979) Plasminogen
Name:Plasminogen
Type:Enzyme
Mol. Mass.:90579.18
Organism:Homo sapiens (Human)
Description:n/a
Residue:810
BDBM50038002
NameBDBM50038002
Synonyms:Benzamidine (Protonated) CHEMBL537204 | benzamidine
TypeSmall organic molecule
Emp. Form.C7H8N2
Mol. Mass.120.1518
SMILESNC(=N)c1ccccc1