Reaction Details
TargetDNA gyrase subunit B
LigandBDBM50010338
Substrate/Competitorn/a
Meas. Tech.ChEMBL_1353018 (CHEMBL3270626)
IC50 3.7±n/a nM
Citation Ahuja, VBasavarajappa, HP, SHBoriack-Sjodin, PAMcKinney, DGanguly, SKranthi, UGaonkar, SJena, LkGhorpade, SRGhosh, ABarde, SKale, MGKoushik, KKumar, CNManjunatha, MROgg, DPanduga, VRamya, VKReddy, JKumar, KNGiridhar, JRudrapatna, SSharma, STucker, JAVachaspati, PWaterson, Dde Sousa, SM Thiazolopyridine ureas as novel antitubercular agents acting through inhibition of DNA Gyrase B. Cell Chem Biol56:8834-48 (2013) 
 
DNA gyrase subunit B
Name:DNA gyrase subunit B
Type:PROTEIN
Mol. Mass.:74505.25
Organism:Mycobacterium smegmatis
Description:ChEMBL_107961
Residue:675
BDBM50010338
NameBDBM50010338
Synonyms:CHEMBL3259858
TypeSmall organic molecule
Emp. Form.C21H26N6O4S
Mol. Mass.458.534
SMILESCCNC(=O)Nc1nc2cc(c(N[C@H]3CCOC3)nc2s1)-c1ccn(CCOC)c(=O)c1