Reaction Details
TargetEpidermal growth factor receptor
LigandBDBM50010387
Substrate/Competitorn/a
Meas. Tech.ChEMBL_1353177 (CHEMBL3266279)
IC50 168±n/a nM
Citation Szokol, BGyulavári, PKurkó, IBaska, FSzántai-Kis, CGreff, ZOrfi, ZPeták, IPénzes, KTorka, RUllrich, AOrfi, LVántus, TKéri, G Discovery and Biological Evaluation of Novel Dual EGFR/c-Met Inhibitors. ACS Med Chem Lett5:298-303 (2014) 
 
Epidermal growth factor receptor
Name:Epidermal growth factor receptor
Type:Receptor Kinase Domain
Mol. Mass.:134279.59
Organism:Homo sapiens (Human)
Description:P00533
Residue:1210
BDBM50010387
NameBDBM50010387
Synonyms:CHEMBL3263963
TypeSmall organic molecule
Emp. Form.C34H35FN4O6S
Mol. Mass.646.728
SMILESCOc1cc2c(Oc3ccc(NS(=O)(=O)c4cccc(c4)-c4ccoc4)cc3F)ccnc2cc1OCCCN1CCN(C)CC1