Reaction Details
TargetEpidermal growth factor receptor
LigandBDBM50010392
Substrate/Competitorn/a
Meas. Tech.ChEMBL_1353177 (CHEMBL3266279)
IC50 1052±n/a nM
Citation Szokol, BGyulavári, PKurkó, IBaska, FSzántai-Kis, CGreff, ZOrfi, ZPeták, IPénzes, KTorka, RUllrich, AOrfi, LVántus, TKéri, G Discovery and Biological Evaluation of Novel Dual EGFR/c-Met Inhibitors. ACS Med Chem Lett5:298-303 (2014) 
 
Epidermal growth factor receptor
Name:Epidermal growth factor receptor
Type:Receptor Kinase Domain
Mol. Mass.:134279.59
Organism:Homo sapiens (Human)
Description:P00533
Residue:1210
BDBM50010392
NameBDBM50010392
Synonyms:CHEMBL3263968
TypeSmall organic molecule
Emp. Form.C34H35FN4O5S2
Mol. Mass.662.794
SMILESCOc1cc2c(Oc3ccc(NS(=O)(=O)c4cccc(c4)-c4cccs4)cc3F)ccnc2cc1OCCCN1CCN(C)CC1