Reaction Details
TargetHepatocyte growth factor receptor
LigandBDBM50010385
Substrate/Competitorn/a
Meas. Tech.ChEMBL_1353179 (CHEMBL3266281)
IC50 1719±n/a nM
Citation Szokol, BGyulavári, PKurkó, IBaska, FSzántai-Kis, CGreff, ZOrfi, ZPeták, IPénzes, KTorka, RUllrich, AOrfi, LVántus, TKéri, G Discovery and Biological Evaluation of Novel Dual EGFR/c-Met Inhibitors. ACS Med Chem Lett5:298-303 (2014) 
 
Hepatocyte growth factor receptor
Name:Hepatocyte growth factor receptor
Type:Protein
Mol. Mass.:155559.73
Organism:Homo sapiens (Human)
Description:P08581
Residue:1390
BDBM50010385
NameBDBM50010385
Synonyms:CHEMBL3263961
TypeSmall organic molecule
Emp. Form.C33H34FN5O6S
Mol. Mass.647.716
SMILESCOc1cc2c(Oc3ccc(NS(=O)(=O)c4cccc(c4)-c4cnn(C)c4)cc3F)ccnc2cc1OCCCN1CCOCC1