Reaction Details
TargetHepatocyte growth factor receptor
LigandBDBM50010390
Substrate/Competitorn/a
Meas. Tech.ChEMBL_1353179 (CHEMBL3266281)
IC50 1225±n/a nM
Citation Szokol, BGyulavári, PKurkó, IBaska, FSzántai-Kis, CGreff, ZOrfi, ZPeták, IPénzes, KTorka, RUllrich, AOrfi, LVántus, TKéri, G Discovery and Biological Evaluation of Novel Dual EGFR/c-Met Inhibitors. ACS Med Chem Lett5:298-303 (2014) 
 
Hepatocyte growth factor receptor
Name:Hepatocyte growth factor receptor
Type:Protein
Mol. Mass.:155559.73
Organism:Homo sapiens (Human)
Description:P08581
Residue:1390
BDBM50010390
NameBDBM50010390
Synonyms:CHEMBL3263966
TypeSmall organic molecule
Emp. Form.C34H37FN6O5S
Mol. Mass.660.758
SMILESCOc1cc2c(Oc3ccc(NS(=O)(=O)c4ccc(cc4)-c4cnn(C)c4)cc3F)ccnc2cc1OCCCN1CCN(C)CC1