Reaction Details
TargetHepatocyte growth factor receptor
LigandBDBM5446
Substrate/Competitorn/a
Meas. Tech.ChEMBL_1353179 (CHEMBL3266281)
IC50>12500±n/a nM
Citation Szokol, BGyulavári, PKurkó, IBaska, FSzántai-Kis, CGreff, ZOrfi, ZPeták, IPénzes, KTorka, RUllrich, AOrfi, LVántus, TKéri, G Discovery and Biological Evaluation of Novel Dual EGFR/c-Met Inhibitors. ACS Med Chem Lett5:298-303 (2014) 
 
Hepatocyte growth factor receptor
Name:Hepatocyte growth factor receptor
Type:Protein
Mol. Mass.:155559.73
Organism:Homo sapiens (Human)
Description:P08581
Residue:1390
BDBM5446
NameBDBM5446
Synonyms:CHEMBL553 Erlotinib N-(3-Ethynylphenyl)-6,7-bis(2-methoxyethoxy)-4-quinazolinamine Monohydrochloride OSI-774 US10189853, erlotinib US11524945, Compound Erlotinib US9730934, Erlotinib cid_176870
TypeSmall organic molecule
Emp. Form.C22H23N3O4
Mol. Mass.393.4357
SMILESCOCCOc1cc2ncnc(Nc3cccc(c3)C#C)c2cc1OCCOC