Reaction Details
TargetInsulin receptor
LigandBDBM50010384
Substrate/Competitorn/a
Meas. Tech.ChEMBL_1353180 (CHEMBL3266282)
IC50>12500±n/a nM
Citation Szokol, BGyulavári, PKurkó, IBaska, FSzántai-Kis, CGreff, ZOrfi, ZPeták, IPénzes, KTorka, RUllrich, AOrfi, LVántus, TKéri, G Discovery and Biological Evaluation of Novel Dual EGFR/c-Met Inhibitors. ACS Med Chem Lett5:298-303 (2014) 
 
Insulin receptor
Name:Insulin receptor
Type:Receptor Tyrosine Kinase
Mol. Mass.:156322.60
Organism:Homo sapiens (Human)
Description:P06213
Residue:1382
BDBM50010384
NameBDBM50010384
Synonyms:CHEMBL3263960
TypeSmall organic molecule
Emp. Form.C33H32FN3O7S
Mol. Mass.633.686
SMILESCOc1cc2c(Oc3ccc(NS(=O)(=O)c4cccc(c4)-c4ccoc4)cc3F)ccnc2cc1OCCCN1CCOCC1