Reaction Details
TargetInsulin receptor
LigandBDBM50010389
Substrate/Competitorn/a
Meas. Tech.ChEMBL_1353180 (CHEMBL3266282)
IC50 11805±n/a nM
Citation Szokol, BGyulavári, PKurkó, IBaska, FSzántai-Kis, CGreff, ZOrfi, ZPeták, IPénzes, KTorka, RUllrich, AOrfi, LVántus, TKéri, G Discovery and Biological Evaluation of Novel Dual EGFR/c-Met Inhibitors. ACS Med Chem Lett5:298-303 (2014) 
 
Insulin receptor
Name:Insulin receptor
Type:Receptor Tyrosine Kinase
Mol. Mass.:156322.60
Organism:Homo sapiens (Human)
Description:P06213
Residue:1382
BDBM50010389
NameBDBM50010389
Synonyms:CHEMBL3263965
TypeSmall organic molecule
Emp. Form.C34H34F2N4O5S2
Mol. Mass.680.784
SMILESCOc1cc2c(Oc3ccc(NS(=O)(=O)c4cc(ccc4F)-c4ccsc4)cc3F)ccnc2cc1OCCCN1CCN(C)CC1