Reaction Details
TargetDipeptidyl carboxypeptidase
LigandBDBM50010477
Substrate/Competitorn/a
Meas. Tech.ChEMBL_1353482 (CHEMBL3269465)
IC50 150000±n/a nM
Citation Kramer, GJMohd, ASchwager, SLMasuyer, GAcharya, KRSturrock, EDBachmann, BO Interkingdom pharmacology of Angiotensin-I converting enzyme inhibitor phosphonates produced by actinomycetes. ACS Med Chem Lett5:346-51 (2014) 
 
Dipeptidyl carboxypeptidase
Name:Dipeptidyl carboxypeptidase
Type:PROTEIN
Mol. Mass.:77504.73
Organism:Escherichia coli (strain K12)
Description:ChEMBL_108355
Residue:681
BDBM50010477
NameBDBM50010477
Synonyms:CHEMBL1233799
TypeSmall organic molecule
Emp. Form.C25H34N3O8P
Mol. Mass.535.5265
SMILESCC[C@H](C)[C@H](NC(C)=O)C(=O)N[C@@H](Cc1ccc(O)cc1)C(=O)N[C@@H](Cc1ccc(O)cc1)P(O)(O)=O