Reaction Details
TargetMu-type opioid receptor
LigandBDBM50010483
Substrate/Competitorn/a
Meas. Tech.ChEMBL_1353484 (CHEMBL3269820)
Ki 0.143000±n/a nM
Citation Ballet, SBetti, CNovoa, ATömböly, CNielsen, CUHelms, HCLesniak, AKleczkowska, PChung, NNLipkowski, AWBrodin, BTourwé, DSchiller, PW In Vitro Membrane Permeation Studies and in Vivo Antinociception of Glycosylated Dmt ACS Med Chem Lett5:352-357 (2014) 
 
Mu-type opioid receptor
Name:Mu-type opioid receptor
Type:G Protein-Coupled Receptor (GPCR)
Mol. Mass.:44503.11
Organism:Rattus norvegicus (rat)
Description:Competition binding assays were carried out using membrane preparations from transfected HN9.10 cells that constitutively expressed the mu opioid receptor.
Residue:398
BDBM50010483
NameBDBM50010483
Synonyms:CHEMBL2181202
TypeSmall organic molecule
Emp. Form.C32H49N9O5
Mol. Mass.639.7888
SMILESCc1cc(O)cc(C)c1C[C@H](N)C(=O)N[C@H](CCCNC(N)=N)C(=O)N[C@@H](Cc1ccccc1)C(=O)N[C@@H](CCCCN)C(N)=O