Reaction Details
TargetDelta-type opioid receptor
LigandBDBM50010483
Substrate/Competitorn/a
Meas. Tech.ChEMBL_1353488 (CHEMBL3269824)
IC50 23±n/a nM
Citation Ballet, SBetti, CNovoa, ATömböly, CNielsen, CUHelms, HCLesniak, AKleczkowska, PChung, NNLipkowski, AWBrodin, BTourwé, DSchiller, PW In Vitro Membrane Permeation Studies and in Vivo Antinociception of Glycosylated Dmt ACS Med Chem Lett5:352-357 (2014) 
 
Delta-type opioid receptor
Name:Delta-type opioid receptor
Type:Enzyme Catalytic Domain
Mol. Mass.:40577.25
Organism:MOUSE
Description:P32300
Residue:372
BDBM50010483
NameBDBM50010483
Synonyms:CHEMBL2181202
TypeSmall organic molecule
Emp. Form.C32H49N9O5
Mol. Mass.639.7888
SMILESCc1cc(O)cc(C)c1C[C@H](N)C(=O)N[C@H](CCCNC(N)=N)C(=O)N[C@@H](Cc1ccccc1)C(=O)N[C@@H](CCCCN)C(N)=O