Reaction Details
TargetDelta-type opioid receptor
LigandBDBM50010658
Substrate/Competitorn/a
Meas. Tech.ChEMBL_1353644 (CHEMBL3271433)
Ki 0.534000±n/a nM
Citation Fujii, HHayashida, KSaitoh, AYokoyama, AHirayama, SIwai, TNakata, ENemoto, TSudo, YUezono, YYamada, MNagase, H Novel delta opioid receptor agonists with oxazatricyclodecane structure. ACS Med Chem Lett5:368-72 (2014) 
 
Delta-type opioid receptor
Name:Delta-type opioid receptor
Type:Enzyme Catalytic Domain
Mol. Mass.:40577.25
Organism:MOUSE
Description:P32300
Residue:372
BDBM50010658
NameBDBM50010658
Synonyms:CHEMBL3264747
TypeSmall organic molecule
Emp. Form.C29H30N2O5
Mol. Mass.486.5589
SMILES[H][C@]12O[C@]34CC[C@@]5(OCOc6c(O)ccc7C[C@@]3([H])N(CC3CC3)CC[C@]4(c67)[C@]15[H])N(C2=O)c1ccccc1