Reaction Details
TargetIntegrase
LigandBDBM50011014
Substrate/Competitorn/a
Meas. Tech.ChEMBL_1351355 (CHEMBL3266568)
IC50 5100±n/a nM
Citation Fader, LDMalenfant, EParisien, MCarson, RBilodeau, FLandry, SPesant, MBrochu, CMorin, SChabot, CHalmos, TBousquet, YBailey, MDKawai, SHCoulombe, RLaPlante, SJakalian, ABhardwaj, PKWernic, DSchroeder, PAmad, MEdwards, PGarneau, MDuan, JCordingley, MBethell, RMason, SWBös, MBonneau, PPoupart, MAFaucher, AMSimoneau, BFenwick, CYoakim, CTsantrizos, Y Discovery of BI 224436, a Noncatalytic Site Integrase Inhibitor (NCINI) of HIV-1. ACS Med Chem Lett5:422-7 (2014) 
 
Integrase
Name:Integrase
Synonyms:Human immunodeficiency virus type 1 integrase
Type:PROTEIN
Mol. Mass.:32231.48
Organism:Human immunodeficiency virus 1
Description:ChEMBL_90865
Residue:288
BDBM50011014
NameBDBM50011014
Synonyms:CHEMBL3259885
TypeSmall organic molecule
Emp. Form.C18H14BrNO2
Mol. Mass.356.213
SMILESCc1nc2ccc(Br)cc2c(-c2ccccc2)c1CC(O)=O