Reaction Details
TargetIntegrase
LigandBDBM50011130
Substrate/Competitorn/a
Meas. Tech.ChEMBL_1351355 (CHEMBL3266568)
IC50 310±n/a nM
Citation Fader, LDMalenfant, EParisien, MCarson, RBilodeau, FLandry, SPesant, MBrochu, CMorin, SChabot, CHalmos, TBousquet, YBailey, MDKawai, SHCoulombe, RLaPlante, SJakalian, ABhardwaj, PKWernic, DSchroeder, PAmad, MEdwards, PGarneau, MDuan, JCordingley, MBethell, RMason, SWBös, MBonneau, PPoupart, MAFaucher, AMSimoneau, BFenwick, CYoakim, CTsantrizos, Y Discovery of BI 224436, a Noncatalytic Site Integrase Inhibitor (NCINI) of HIV-1. ACS Med Chem Lett5:422-7 (2014) 
 
Integrase
Name:Integrase
Synonyms:Human immunodeficiency virus type 1 integrase
Type:PROTEIN
Mol. Mass.:32231.48
Organism:Human immunodeficiency virus 1
Description:ChEMBL_90865
Residue:288
BDBM50011130
NameBDBM50011130
Synonyms:CHEMBL3259889
TypeSmall organic molecule
Emp. Form.C19H15BrClNO2
Mol. Mass.404.685
SMILESCC(C(O)=O)c1c(C)nc2ccc(Br)cc2c1-c1ccc(Cl)cc1